Announcement

Collapse
No announcement yet.

Cannot install botan and other benchmarks

Collapse
X
  • Filter
  • Time
  • Show
Clear All
new posts

  • Cannot install botan and other benchmarks

    Hi All,

    I am new to Phoronix-Test-Suite. Just installed Phoronix-Test-Suite 6.4.0 on Ubuntu 16.04 desktop.

    It was successful to install and run quite a few benchmarks such as ramspeed and stream etc.

    However it failed to install the following benchmarks - some (like botan) simply cannot be downloaded while other (like gnupg) can be downloaded but cannot be installed.

    The following tests failed to install:

    - pts/system-decompress-gzip-1.1.0
    - pts/graphics-magick-1.6.1
    - pts/powertop-wakeups-1.0.0
    - pts/system-decompress-zlib-1.0.1
    - pts/cachebench-1.0.0
    - pts/povray-1.1.2
    - pts/gnupg-1.3.1
    [collect2: error: ld returned 1 exit status]
    - pts/botan-1.1.0
    - pts/stress-ng-1.0.0
    - pts/opendwarfs-1.0.0
    [OpenCL library not found]

    I tried it on both Intel and AMD platforms and both has the same issues. Please refer to the logs below for details.

    Any help is appreciated.

    Thanks

    --------------------------------------------------------------------------------------------------------------------------------

    $ phoronix-test-suite batch-install system-decompress-gzip graphics-magick powertop-wakeups system-decompress-zlib cachebench povray gnupg botan stress-ng opendwarfs

    Phoronix Test Suite v6.4.0

    To Install: pts/system-decompress-gzip-1.1.0
    Installed: pts/photo-sample-1.0.1
    To Install: pts/graphics-magick-1.6.1
    To Install: pts/powertop-wakeups-1.0.0
    To Install: pts/system-decompress-zlib-1.0.1
    To Install: pts/cachebench-1.0.0
    To Install: pts/povray-1.1.2
    To Install: pts/gnupg-1.3.1
    To Install: pts/botan-1.1.0
    To Install: pts/stress-ng-1.0.0
    To Install: pts/opendwarfs-1.0.0

    Determining File Requirements .................................................. ..................................
    Searching Download Caches .................................................. ......................................

    10 Tests To Install
    9 Files To Download [449MB]
    717MB Of Disk Space Is Needed

    pts/system-decompress-gzip-1.1.0:
    Test Installation 1 of 10
    1 File Needed [219 MB / 2 Minutes]
    Downloading: qt-everywhere-opensource-src-5.0.0.tar.gz [219MB]
    Estimated Download Time: 2m .................................................. ................................
    Checksum Failed: http://releases.qt-project.org/qt5/5...c-5.0.0.tar.gz
    Downloading of needed test files failed.
    pts/graphics-magick-1.6.1:
    Test Installation 2 of 10
    2 Files Needed [7.55 MB / 1 Minute]
    Downloading: GraphicsMagick-1.3.19.tar.bz2 [6.92MB]
    Download Failed: http://iweb.dl.sourceforge.net/proje...1.3.19.tar.bz2
    Attempting to download from alternate mirror.
    Downloading: GraphicsMagick-1.3.19.tar.bz2 [6.92MB]
    Download Failed: http://softlayer-ams.dl.sourceforge....1.3.19.tar.bz2
    Downloading of needed test files failed.
    pts/powertop-wakeups-1.0.0:
    Test Installation 3 of 10
    1 File Needed [0.59 MB / 1 Minute]
    Downloading: powertop-2.2.tar.gz [0.59MB]
    Download Failed: https://01.org/powertop/sites/defaul...top-2.2.tar.gz
    Downloading of needed test files failed.
    pts/system-decompress-zlib-1.0.1:
    Test Installation 4 of 10
    2 Files Needed [220 MB / 2 Minutes]
    Downloading: zlib-1.2.7.tar.bz2 [0.48MB]
    Download Failed: http://softlayer-dal.dl.sourceforge....-1.2.7.tar.bz2
    Downloading of needed test files failed.
    pts/cachebench-1.0.0:
    Test Installation 5 of 10
    1 File Needed [0.17 MB / 1 Minute]
    Downloading: llcbench.tar.gz [0.17MB]
    Download Failed: http://icl.cs.utk.edu/projects/llcbench/llcbench.tar.gz
    Downloading of needed test files failed.
    pts/povray-1.1.2:
    Test Installation 6 of 10
    1 File Needed [34.41 MB / 1 Minute]
    File Found: povray-3.7.0.tar.bz2 [34.41MB]
    Installation Size: 172 MB
    Installing Test @ 13:18:37
    The installer exited with a non-zero exit status.
    LOG: ~/.phoronix-test-suite/installed-tests/pts/povray-1.1.2/install-failed.log

    pts/gnupg-1.3.1:
    Test Installation 7 of 10
    1 File Needed [4.53 MB / 1 Minute]
    File Found: gnupg-1.4.10.tar.gz [4.53MB]
    Installation Size: 8.4 MB
    Installing Test @ 13:18:41
    The installer exited with a non-zero exit status.
    ERROR: collect2: error: ld returned 1 exit status
    LOG: ~/.phoronix-test-suite/installed-tests/pts/gnupg-1.3.1/install-failed.log

    pts/botan-1.1.0:
    Test Installation 8 of 10
    1 File Needed [2.26 MB / 1 Minute]
    Downloading: Botan-1.11.6.tbz [2.26MB]
    Download Failed: http://files.randombit.net/botan/v1.11/Botan-1.11.6.tbz
    Downloading of needed test files failed.
    pts/stress-ng-1.0.0:
    Test Installation 9 of 10
    1 File Needed [0.2 MB / 1 Minute]
    Downloading: stress-ng-0.04.05.tar.gz [0.20MB]
    Estimated Download Time: 1m .................................................. ................................
    Checksum Failed: http://kernel.ubuntu.com/~cking/tarb...0.04.05.tar.gz
    Downloading of needed test files failed.
    pts/opendwarfs-1.0.0:
    Test Installation 10 of 10
    1 File Needed [59.38 MB / 1 Minute]
    File Found: OpenDwarfs-git-20131106.tar.bz2 [59.38MB]
    Installation Size: 476 MB
    Installing Test @ 13:18:59
    The installer exited with a non-zero exit status.
    ERROR: OpenCL library not found
    LOG: ~/.phoronix-test-suite/installed-tests/pts/opendwarfs-1.0.0/install-failed.log


    The following tests failed to install:

    - pts/system-decompress-gzip-1.1.0
    - pts/graphics-magick-1.6.1
    - pts/powertop-wakeups-1.0.0
    - pts/system-decompress-zlib-1.0.1
    - pts/cachebench-1.0.0
    - pts/povray-1.1.2
    - pts/gnupg-1.3.1
    [collect2: error: ld returned 1 exit status]
    - pts/botan-1.1.0
    - pts/stress-ng-1.0.0
    - pts/opendwarfs-1.0.0
    [OpenCL library not found]

  • #2
    Hi amdcl , most of these benchmarks were fixed with various updates in recent months. Sorry for not responding sooner, just been doing some cleanups and checks today.
    Michael Larabel
    http://www.michaellarabel.com/

    Comment

    Working...
    X