Announcement

Collapse
No announcement yet.

Multiple tests fail to install

Collapse
X
  • Filter
  • Time
  • Show
Clear All
new posts

  • Multiple tests fail to install

    I tried some batch benchmarking but several tests fail to install. The failure doesn't seem to be ignored and results in a bogus error message about batch-setup, which I have already run successfully (the config file both for the user and in /etc are correctly saved).

    I noticed some of the downloads from sourceforge fail checksums, probably for the well-known issues, but that doesn't seem to be the source of the issue, although some of the tests seem to lack functioning mirrors as of now.

    My system:
    Code:
    $ phoronix-test-suite detailed-system-info
    
    Phoronix Test Suite v5.8.0
    System Information
    
    Hardware:
    Processor: Intel Core 2 Duo L9400 @ 1.87GHz (2 Cores), Motherboard: LENOVO 74695KG, Chipset: Intel Mobile 4 MCH + ICH9M-E, Memory: 4096MB, Disk: 120GB FM-25S2S-120GBP2, Graphics: Intel Mobile 4 IGP, Audio: Conexant CX20561 (Hermosa), Network: Intel 82567LM Gigabit Connection + Intel Ultimate N WiFi Link 5300
    
    Software:
    OS: Fedora 23, Kernel: 4.2.8-300.fc23.x86_64 (x86_64), Desktop: KDE Frameworks 5, Display Driver: intel 2.99.917, OpenGL: 2.1 Mesa 11.0.6 (git-2555e00), Compiler: GCC 5.3.1 20151207, File-System: ext4, Screen Resolution: 1440x900
    
    
    PROCESSOR:
    
    Core Count: 2
    Thread Count: 2
    Cache Size: 6144 KB
    Instruction Set Extensions: SSE 4.1
    AES Encryption: NO
    Energy Performance Bias: NO
    Virtualization: VT-x
    Compiler Configuration: --build=x86_64-redhat-linux --disable-libgcj --disable-libunwind-exceptions --enable-__cxa_atexit --enable-bootstrap --enable-checking=release --enable-gnu-indirect-function --enable-gnu-unique-object --enable-initfini-array --enable-languages=c,c++,objc,obj-c++,fortran,ada,go,lto --enable-libmpx --enable-multilib --enable-plugin --enable-shared --enable-threads=posix --mandir=/usr/share/man --with-arch_32=i686 --with-isl --with-linker-hash-style=gnu --with-tune=generic
    Disk Scheduler: CFQ
    Disk Mount Options: data=ordered,relatime,rw,seclabel
    Cpu Scaling Governor: acpi-cpufreq ondemand
    Graphics 2d Acceleration: SNA
    The failures:

    Code:
    Phoronix Test Suite v5.8.0
    
        Installed: pts/timed-audio-encode-1.0.0
        Installed: pts/encode-mp3-1.4.0
        To Install: pts/encode-ogg-1.4.1
        Installed: pts/encode-flac-1.5.0
        Installed: pts/encode-ape-1.3.0
        To Install: pts/encode-wavpack-1.2.1
        Installed: pts/crafty-1.3.0
        Installed: pts/tscp-1.2.0
        Installed: pts/build-apache-1.5.1
        Installed: pts/build-php-1.3.1
        Installed: pts/build-mplayer-1.3.0
        Installed: pts/build-linux-kernel-1.6.0
        Installed: pts/build-imagemagick-1.7.2
        Installed: pts/compress-gzip-1.1.0
        Installed: pts/sqlite-1.9.0
        Installed: pts/apache-1.6.1
        Installed: pts/pgbench-1.5.2
        Installed: pts/compilebench-1.0.1
        Installed: pts/iozone-1.8.0
        Installed: pts/dbench-1.0.0
        To Install: pts/fs-mark-1.0.1
        Installed: pts/fio-1.8.2
        To Install: pts/tiobench-1.2.0
        Installed: pts/postmark-1.1.0
        Installed: pts/aio-stress-1.1.1
        Installed: pts/linux-kernel-base-1.0.0
        Installed: pts/unpack-linux-1.0.0
        Installed: pts/compress-7zip-1.6.1
        Installed: pts/compress-pbzip2-1.5.0
        To Install: pts/compress-lzma-1.2.0
        Installed: pts/byte-1.2.0
        Installed: pts/scimark2-1.2.0
        Installed: pts/fhourstones-1.1.1
        Installed: pts/gmpbench-1.1.0
        Installed: pts/dcraw-1.1.0
        Installed: pts/sudokut-1.0.0
        To Install: pts/nero2d-1.0.1
        Installed: pts/hmmer-1.1.0
        Installed: pts/mafft-1.4.0
        Installed: pts/mrbayes-1.2.0
        Installed: pts/minion-1.4.0
        To Install: pts/gnupg-1.3.1
        Installed: pts/openssl-1.9.0
        Installed: pts/gcrypt-1.0.3
        Installed: pts/john-the-ripper-1.5.1
        Installed: pts/nexuiz-1.6.1
        To Install: pts/warsow-1.5.1
        Not Supported: pts/ppracer-1.1.1
        Installed: pts/tremulous-1.1.0
        Installed: pts/openarena-1.5.3
        Installed: pts/urbanterror-1.2.1
        Installed: pts/padman-1.1.0
        Installed: pts/smokin-guns-1.2.2
        To Install: pts/vdrift-1.2.0
        Installed: pts/gtkperf-1.2.1
        To Install: pts/qgears2-1.0.1
        To Install: pts/doom3-1.1.0
        Installed: pts/etqw-1.1.0
        Installed: pts/prey-1.1.2
        Installed: pts/unigine-sanctuary-1.6.2
        Installed: pts/unigine-tropics-1.6.2
        Installed: pts/lightsmark-1.2.0
        Installed: pts/sunflow-1.1.0
        Installed: pts/bork-1.0.0
        Installed: pts/java-scimark2-1.1.1
        Installed: pts/video-sample-1.0.0
        Installed: pts/mencoder-1.4.1
        Installed: pts/ffmpeg-2.5.0
        Installed: pts/x264-2.0.0
        Installed: pts/smallpt-1.0.2
        Installed: pts/photo-sample-1.0.1
        Installed: pts/graphics-magick-1.6.1
        Installed: pts/bullet-1.2.1
        Installed: pts/c-ray-1.1.0
        Installed: pts/unigine-heaven-1.6.2
        Installed: pts/nexuiz-iqc-1.0.0
        Installed: pts/etqw-demo-1.1.0
        Installed: pts/etqw-demo-iqc-1.0.0
        Installed: pts/tachyon-1.1.1
        To Install: pts/povray-1.1.2
        Installed: pts/pybench-1.0.0
        Installed: pts/himeno-1.1.0
        Installed: pts/npb-1.2.1
        Installed: pts/network-loopback-1.0.1
        Installed: pts/ttsiod-renderer-1.6.0
        To Install: pts/juliagpu-1.3.0
        To Install: pts/mandelgpu-1.3.1
        To Install: pts/smallpt-gpu-1.3.0
        To Install: pts/mandelbulbgpu-1.3.0
        Installed: pts/gluxmark-1.1.1
        Installed: pts/specviewperf9-1.1.0
        Installed: pts/specviewperf10-1.3.0
        To Install: pts/xplane9-1.3.0
        Installed: pts/nginx-1.1.0
        Installed: pts/phpbench-1.1.0
        Installed: pts/stream-1.2.0
        Installed: pts/render-bench-1.1.2
    
        Determining File Requirements ...........................................................................................................................................
        Searching Download Caches ...............................................................................................................................................
    
        17 Tests To Install
            9 Files To Download [3122MB]
            4294MB Of Disk Space Is Needed
    
        pts/encode-ogg-1.4.1:
            Test Installation 1 of 17
            3 Files Needed [3.1 MB / 1 Minute]
            File Found: libogg-1.3.0.tar.gz                                                                                                                              [0.41MB]
            File Found: libvorbis-1.3.2.tar.gz                                                                                                                           [1.41MB]
            File Found: vorbis-tools-1.4.0.tar.gz                                                                                                                        [1.28MB]
            Installation Size: 6 MB
            Installing Test @ 14:00:35
                The installer exited with a non-zero exit status.
                ERROR: collect2: error: ld returned 1 exit status
                LOG: ~/.phoronix-test-suite/installed-tests/pts/encode-ogg-1.4.1/install-failed.log
    
        pts/encode-wavpack-1.2.1:
            Test Installation 2 of 17
            1 File Needed [0.31 MB / 1 Minute]
            File Found: wavpack-4.70.0.tar.bz2                                                                                                                           [0.31MB]
            Installing Test @ 14:01:22
                The installer exited with a non-zero exit status.
                LOG: ~/.phoronix-test-suite/installed-tests/pts/encode-wavpack-1.2.1/install-failed.log
    
        pts/fs-mark-1.0.1:
            Test Installation 3 of 17
            1 File Needed [0.01 MB / 1 Minute]
            File Found: fs_mark-3.3.tar.gz                                                                                                                               [0.01MB]
            Installation Size: 1 MB
            Installing Test @ 14:01:22
                The installer exited with a non-zero exit status.
                ERROR: collect2: error: ld returned 1 exit status
                LOG: ~/.phoronix-test-suite/installed-tests/pts/fs-mark-1.0.1/install-failed.log
    
        pts/tiobench-1.2.0:
            Test Installation 4 of 17
            1 File Needed [0.03 MB / 1 Minute]
            File Found: tiobench-0.3.3.tar.gz                                                                                                                            [0.03MB]
            Installation Size: 0.2 MB
            Installing Test @ 14:01:24
                The installer exited with a non-zero exit status.
                ERROR: collect2: error: ld returned 1 exit status
                LOG: ~/.phoronix-test-suite/installed-tests/pts/tiobench-1.2.0/install-failed.log
    
        pts/compress-lzma-1.2.0:
            Test Installation 5 of 17
            1 File Needed [0.46 MB / 1 Minute]
            Downloading: lzma-4.32.6.tar.gz                                                                                                                              [0.46MB]
            Estimated Download Time: 1m .........................................................................................................................................
                File Not Found: http://mirror.internode.on.net/pub/gentoo-portage/distfiles/lzma-4.32.6.tar.gz
                Attempting to download from alternate mirror.
            Downloading: lzma-4.32.6.tar.gz                                                                                                                              [0.46MB]
            Estimated Download Time: 1m .........................................................................................................................................
                File Not Found: http://buildroot.uclibc.org/downloads/sources/lzma-4.32.6.tar.gz
                Downloading of needed test files failed.
        pts/nero2d-1.0.1:
            Test Installation 6 of 17
            1 File Needed [1.48 MB / 1 Minute]
            File Found: nero2d-2.0.2.tar.gz                                                                                                                              [1.48MB]
            Installation Size: 46.4 MB
            Installing Test @ 14:01:28
                The installer exited with a non-zero exit status.
                LOG: ~/.phoronix-test-suite/installed-tests/pts/nero2d-1.0.1/install-failed.log
    
        pts/gnupg-1.3.1:
            Test Installation 7 of 17
            1 File Needed [4.53 MB / 1 Minute]
            File Found: gnupg-1.4.10.tar.gz                                                                                                                              [4.53MB]
            Installation Size: 8.4 MB
            Installing Test @ 14:01:48
                The installer exited with a non-zero exit status.
                ERROR: collect2: error: ld returned 1 exit status
                LOG: ~/.phoronix-test-suite/installed-tests/pts/gnupg-1.3.1/install-failed.log
    
        pts/warsow-1.5.1:
            Test Installation 8 of 17
            2 Files Needed [574 MB / 43 Minutes]
            Downloading: warsow_1.51_unified.tar.gz                                                                                                                       [574MB]
            Estimated Download Time: 43m ........................................................................................................................................
                File Not Found: http://download2.polytechnic.edu.na/pub4/sourceforge/w/wa/warsow.mirror/Warsow%201.51/warsow_1.51_unified.tar.gz
                Attempting to download from alternate mirror.
            Downloading: warsow_1.51_unified.tar.gz                                                                                                                       [574MB]
            Estimated Download Time: 43m ........................................................................................................................................
                Checksum Failed: http://mirror.vinnymac.org/Games/Warsow/1.51/warsow_1.51_unified.tar.gz
                Downloading of needed test files failed.
        pts/vdrift-1.2.0:
            Test Installation 9 of 17
            2 Files Needed [524 MB / 39 Minutes]
            Downloading: vdrift-2010-06-30.tar.bz2                                                                                                                        [524MB]
            Estimated Download Time: 39m ........................................................................................................................................
                Download Failed: http://garr.dl.sourceforge.net/project/vdrift/vdrift/vdrift-2010-06-30/vdrift-2010-06-30.tar.bz2
                Attempting to download from alternate mirror.
            Downloading: vdrift-2010-06-30.tar.bz2                                                                                                                        [524MB]
                Download Failed: http://voxel.dl.sourceforge.net/project/vdrift/vdrift/vdrift-2010-06-30/vdrift-2010-06-30.tar.bz2
                Downloading of needed test files failed.
        pts/qgears2-1.0.1:
            Test Installation 10 of 17
            1 File Needed [0.26 MB / 1 Minute]
            File Found: qgears2.tar.bz2                                                                                                                                  [0.26MB]
            Installation Size: 0.5 MB
            Installing Test @ 14:08:48
                The installer exited with a non-zero exit status.
                ERROR: pts/qgears2-1.0.1/install.sh: line 33: qmake: command not found
                LOG: ~/.phoronix-test-suite/installed-tests/pts/qgears2-1.0.1/install-failed.log
    
        pts/doom3-1.1.0:
            Test Installation 11 of 17
            3 Files Needed [1505 MB / 1 Hour, 51 Minutes]
            Downloading: doom3-linux-1.3.1.1304.x86.run                                                                                                                 [20.17MB]
                Download Failed: ftp://ftp.idsoftware.com/idstuff/doom3/linux/doom3-linux-1.3.1.1304.x86.run
                Downloading of needed test files failed.
        pts/povray-1.1.2:
            Test Installation 12 of 17
            1 File Needed [34.41 MB / 3 Minutes]
            File Found: povray-3.7.0.tar.bz2                                                                                                                            [34.41MB]
            Installation Size: 172 MB
            Installing Test @ 14:09:09
                The installer exited with a non-zero exit status.
                LOG: ~/.phoronix-test-suite/installed-tests/pts/povray-1.1.2/install-failed.log
    
        pts/juliagpu-1.3.0:
            Test Installation 13 of 17
            1 File Needed [0.03 MB / 1 Minute]
            File Found: JuliaGPU-v1.2pts-1.tar.bz2                                                                                                                       [0.03MB]
            Installation Size: 1.0 MB
            Installing Test @ 14:09:15
                The installer exited with a non-zero exit status.
                ERROR: collect2: error: ld returned 1 exit status
                LOG: ~/.phoronix-test-suite/installed-tests/pts/juliagpu-1.3.0/install-failed.log
    
        pts/mandelgpu-1.3.1:
            Test Installation 14 of 17
            1 File Needed [0.02 MB / 1 Minute]
            File Found: MandelGPU-v1.3pts-1.tar.bz2                                                                                                                      [0.02MB]
            Installation Size: 0.1 MB
            Installing Test @ 14:09:18
                The installer exited with a non-zero exit status.
                ERROR: collect2: error: ld returned 1 exit status
                LOG: ~/.phoronix-test-suite/installed-tests/pts/mandelgpu-1.3.1/install-failed.log
    
        pts/smallpt-gpu-1.3.0:
            Test Installation 15 of 17
            1 File Needed [0.04 MB / 1 Minute]
            File Found: SmallptGPU-v1.6pts-1.tar.bz2                                                                                                                     [0.04MB]
            Installation Size: 1.0 MB
            Installing Test @ 14:09:21
                The installer exited with a non-zero exit status.
                ERROR: collect2: error: ld returned 1 exit status
                LOG: ~/.phoronix-test-suite/installed-tests/pts/smallpt-gpu-1.3.0/install-failed.log
    
        pts/mandelbulbgpu-1.3.0:
            Test Installation 16 of 17
            1 File Needed [0.03 MB / 1 Minute]
            File Found: mandelbulbGPU-v1.0pts-1.tar.bz2                                                                                                                  [0.03MB]
            Installation Size: 1.0 MB
            Installing Test @ 14:09:23
                The installer exited with a non-zero exit status.
                ERROR: collect2: error: ld returned 1 exit status
                LOG: ~/.phoronix-test-suite/installed-tests/pts/mandelbulbgpu-1.3.0/install-failed.log
    
        pts/xplane9-1.3.0:
            Test Installation 17 of 17
            1 File Needed [520 MB / 39 Minutes]
            Downloading: xplane_945_timedemo.tar.bz2                                                                                                                      [520MB]
            Estimated Download Time: 39m ........................................................................................................................................
                File Not Found: http://update.x-plane.com/xplane_945_timedemo.tar.bz2
                Downloading of needed test files failed.
    
    The following tests failed to install:
    
      - pts/encode-ogg-1.4.1
        [collect2: error: ld returned 1 exit status]
      - pts/encode-wavpack-1.2.1
      - pts/fs-mark-1.0.1
        [collect2: error: ld returned 1 exit status]
      - pts/tiobench-1.2.0
        [collect2: error: ld returned 1 exit status]
      - pts/compress-lzma-1.2.0
      - pts/nero2d-1.0.1
      - pts/gnupg-1.3.1
        [collect2: error: ld returned 1 exit status]
      - pts/warsow-1.5.1
      - pts/vdrift-1.2.0
      - pts/qgears2-1.0.1
        [pts/qgears2-1.0.1/install.sh: line 33: qmake: command not found]
      - pts/doom3-1.1.0
      - pts/povray-1.1.2
      - pts/juliagpu-1.3.0
        [collect2: error: ld returned 1 exit status]
      - pts/mandelgpu-1.3.1
        [collect2: error: ld returned 1 exit status]
      - pts/smallpt-gpu-1.3.0
        [collect2: error: ld returned 1 exit status]
      - pts/mandelbulbgpu-1.3.0
        [collect2: error: ld returned 1 exit status]
      - pts/xplane9-1.3.0
    Detailed failure logs: https://web.archive.org/web/20151228...5447/30928714/

  • #2
    I did not manage to succeed in the batch-setup, so I just did a normal benchmark rather than batch-benchmark.

    Almost all of the tests failed to install for me in fedora 23: https://paste.debian.net/356774
    In the end I only managed to run the following suites:
    Code:
    phoronix-test-suite benchmark pts/chess pts/compilation pts/ioquake3-games pts/java pts/opengl-demos pts/video-encoding pts/iqc
    Even phoronix-test-suite debug-install complains that I didn't install blas, while in fact I did. Same for the GNU C developmernt libraries with support for 32 bit, I did dnf install glibc-devel.i686 libgcc.i686 per https://ask.fedoraproject.org/en/que...dora-2164bits/ but no win. There is no gcc.i686 in the repos either. On the other hand, if even blas – which is most certainly installed , isn't detected, maybe that's not the issue.

    Comment


    • #3
      Hello,

      I am experiencing similar problems (first one encode-wavpack).

      After some investigation I found, that the .tar.bz2-package which is being downloaded, has a wrong name.

      So I decided to install it manually, which does not work. The binarys are there, linked, everything compiled perfectly, but PTS won't recognize.

      Currently running Gentoo with 4.4.0 Kernel.

      Comment


      • #4
        Hello Mentors,

        Even i am experiencing similar issue, I wanted to analyze the graphics stability and performance, so i picked 3 test suites that available with the config.
        Among those 2 were failed(xrender & GUI-toolkits) and one(workstation-Graphics) ran with few subtests failing. Pasting the log for reference also looked into the failure log on the device which didn't helped me much.

        Config:
        Processor: ARM
        OS : Ubuntu 14.04
        RAM : 4GB

        It's a development board, So need your help. I have tried other system related suits as well, They are also not successful for few of them.
        It would be great if you can list out a compatible tests/suites for ARM based mobile processor is much appreciated.

        Log:
        [email protected]:/root$ phoronix-test-suite debug-install xrender

        Phoronix Test Suite v4.8.3

        To Install: pts/render-bench-1.1.2
        To Install: pts/qgears2-1.0.1

        Determining File Requirements ..........................................
        Searching Download Caches ..............................................

        2 Tests To Install
        1MB Of Disk Space Is Needed

        pts/render-bench-1.1.2:
        Test Installation 1 of 2
        1 File Needed [0.02 MB / 1 Minute]
        File Found: render_bench.tar.gz [0.02MB]
        Installation Size: 0.12 MB
        Installing Test @ 12:58:00

        pts/qgears2-1.0.1:
        Test Installation 2 of 2
        1 File Needed [0.26 MB / 1 Minute]
        File Found: qgears2.tar.bz2 [0.26MB]
        Installation Size: 0.5 MB
        Installing Test @ 12:58:01
        The installer exited with a non-zero exit status.
        ERROR: commonrenderer.cpp:186:42: error: no matching function for call to 'CommonRenderer::animate(qreal [12], qreal [12], int, int&)'
        LOG: ~/.phoronix-test-suite/installed-tests/pts/qgears2-1.0.1/install-failed.log


        [email protected]:/root$ phoronix-test-suite debug-install gui-toolkits

        Phoronix Test Suite v4.8.3

        To Install: pts/gtkperf-1.2.1
        To Install: pts/qgears2-1.0.1

        Determining File Requirements ..........................................
        Searching Download Caches ..............................................

        2 Tests To Install
        1MB Of Disk Space Is Needed

        pts/gtkperf-1.2.1:
        Test Installation 1 of 2
        1 File Needed [0.38 MB / 1 Minute]
        File Found: gtkperf_0.40.tar.gz [0.38MB]
        Installation Size: 0.11 MB
        Installing Test @ 12:58:35
        The installer exited with a non-zero exit status.
        ERROR: cannot guess build type; you must specify one
        LOG: ~/.phoronix-test-suite/installed-tests/pts/gtkperf-1.2.1/install-failed.log

        pts/qgears2-1.0.1:
        Test Installation 2 of 2
        1 File Needed [0.26 MB / 1 Minute]
        File Found: qgears2.tar.bz2 [0.26MB]
        Installation Size: 0.5 MB
        Installing Test @ 12:58:39
        The installer exited with a non-zero exit status.
        ERROR: commonrenderer.cpp:186:42: error: no matching function for call to 'CommonRenderer::animate(qreal [12], qreal [12], int, int&)'
        LOG: ~/.phoronix-test-suite/installed-tests/pts/qgears2-1.0.1/install-failed.log


        The following tests failed to install:

        - pts/gtkperf-1.2.1
        - pts/qgears2-1.0.1

        [email protected]:/root$ phoronix-test-suite debug-install workstation-graphics
        pts/xplane9-1.3.0 is not supported on this architecture: aarch64

        Phoronix Test Suite v4.8.3

        To Install: pts/specviewperf9-1.1.0
        To Install: pts/specviewperf10-1.3.0
        Not Supported: pts/xplane9-1.3.0

        Determining File Requirements ..........................................
        Searching Download Caches ..............................................

        2 Tests To Install
        3400MB Of Disk Space Is Needed

        pts/specviewperf9-1.1.0:
        Test Installation 1 of 2
        1 File Needed [625 MB / 1 Hour, 16 Minutes]
        File Found: SPECViewperf9.0.3.tar.gz [625MB]
        Installation Size: 1800 MB
        Installing Test @ 13:04:39

        pts/specviewperf10-1.3.0:
        Test Installation 2 of 2
        2 Files Needed [586 MB / 1 Hour, 12 Minutes]
        File Found: SPECViewperf10.tgz [586MB]
        File Found: SPECViewperf101.diff.tar.bz2 [0.01MB]
        Installation Size: 1600 MB
        Installing Test @ 13:06:13

        Thanks in Advance.

        Comment


        • #5
          Similar to bpechetti's log I created the following list with failing tests/suites.

          First, those who are being downloaded from alternative mirrors:

          compliation (suite)
          -> build-php (test)
          Link to the error-messages: http://pastebin.com/YEn9byhK

          compiler (suite)
          -> graphics-magick
          Link to the error-messages: http://pastebin.com/gaeruAGU

          computational (suite)
          -> minion (test)
          Link to the error-messages: http://pastebin.com/5hKwXbLr

          cpu (suite)
          -> padman (test)
          Link to the error-messages: http://pastebin.com/Qir738J3

          cryptography (suite)
          -> gnupg (test)
          Link to the error-messages: http://pastebin.com/5Xx7mjhe

          pts-desktop-live (suite)
          -> video-cpu-usage (test)
          Link to the error-messages: http://pastebin.com/CMBxsBFQ

          Second, those that cannot be downloaded properly:

          bork (test)
          Link to the error-messages: http://pastebin.com/peAF70hC

          opengl-workstation (suite)
          -> specviewperf9 (test)
          Link to the error-messages: http://pastebin.com/ZPRPjC7V

          workstation-graphics (suite)
          -> pts/xplane9
          Link to the error-messages: http://pastebin.com/9mWZvVg5

          I'll compile more lists with compilation- and dependencie-errors soon.

          Comment


          • #6
            Similar to bpechetti's log I created the following list with failing tests/suites.

            First, those who are being downloaded from alternative mirrors:

            compliation (suite)
            -> build-php (test)
            Link to the error-messages: http://pastebin.com/YEn9byhK

            compiler (suite)
            -> graphics-magick
            Link to the error-messages: http://pastebin.com/gaeruAGU

            computational (suite)
            -> minion (test)
            Link to the error-messages: http://pastebin.com/5hKwXbLr

            cpu (suite)
            -> padman (test)
            Link to the error-messages: http://pastebin.com/Qir738J3

            cryptography (suite)
            -> gnupg (test)
            Link to the error-messages: http://pastebin.com/5Xx7mjhe

            pts-desktop-live (suite)
            -> video-cpu-usage (test)
            Link to the error-messages: http://pastebin.com/CMBxsBFQ

            Second, those that cannot be downloaded properly:

            bork (test)
            Link to the error-messages: http://pastebin.com/peAF70hC

            opengl-workstation (suite)
            -> specviewperf9 (test)
            Link to the error-messages: http://pastebin.com/ZPRPjC7V

            workstation-graphics (suite)
            -> pts/xplane9
            Link to the error-messages: http://pastebin.com/9mWZvVg5

            I'll compile more lists with compilation- and dependencie-errors soon.

            Comment

            Working...
            X