Announcement

Collapse
No announcement yet.

Mesa 17.2.2 Released

Collapse
X
  • Filter
  • Time
  • Show
Clear All
new posts

  • Mesa 17.2.2 Released

    Phoronix: Mesa 17.2.2 Released

    As expected, Mesa 17.2.2 was released today by Igalia's Juan Suarez Romero...

    http://www.phoronix.com/scan.php?pag...7.2.2-Released

  • #2
    Meanwhile, Debian testing is still stuck. ARM issues were resolved, but now there is this: https://bugs.debian.org/cgi-bin/bugr...cgi?bug=876752

    At least it looks things are "in progress": https://bugs.debian.org/cgi-bin/bugr...cgi?bug=876570
    Last edited by shmerl; 10-02-2017, 12:49 PM.

    Comment


    • #3
      Originally posted by shmerl View Post
      Meanwhile, Debian testing is still stuck. ARM issues were resolved, but now there is this: https://bugs.debian.org/cgi-bin/bugr...cgi?bug=876752

      At least it looks things are "in progress": https://bugs.debian.org/cgi-bin/bugr...cgi?bug=876570
      Well, debian just does not focus on being a fast moving rolling distro. They say it clearly on their homepage "the goal of debian is to produce stable".
      So, considering the next stable is still years away, it's understandable that this is not priority for maintainers right now.
      Nothing against debian, but if you just want a rolling release distro, you might be happier elsewhere.

      Comment


      • #4

        TIME_ELAPSED is still broken/violating the spec and for some reason, vulkan is not initialising (280x).

        Comment


        • #5
          17.2.2 landed in Artful today. Vulkan is still broken out of the box on my Fury, same as it was on Zesty. I filed a bug report against mesa-vulkan-drivers for me libvulkan_radeon.so is the issue. Does anyone else using Artful have this issue with their AMD card ? https://bugs.launchpad.net/ubuntu/+s...a/+bug/1720890

          Comment


          • #6
            Originally posted by DarkFoss View Post
            17.2.2 landed in Artful today. Vulkan is still broken out of the box on my Fury, same as it was on Zesty. I filed a bug report against mesa-vulkan-drivers for me libvulkan_radeon.so is the issue. Does anyone else using Artful have this issue with their AMD card ? https://bugs.launchpad.net/ubuntu/+s...a/+bug/1720890
            I don't use ubuntu, but vulkan fails to initialise on my 280x, on gentoo and solus both.

            Comment


            • #7
              Originally posted by fctcris View Post

              I don't use ubuntu, but vulkan fails to initialise on my 280x, on gentoo and solus both.
              Out of curiosity did you install vulkan-utils? Does running vulkan-smoketest in a terminal segfault and leave a libvulkan_radeon.so error in the kernel @ syslogs?

              Comment


              • #8
                Originally posted by DarkFoss View Post

                Out of curiosity did you install vulkan-utils? Does running vulkan-smoketest in a terminal segfault and leave a libvulkan_radeon.so error in the kernel @ syslogs?
                No. I can't even build it now apparently.
                Flags are:
                Code:
                 
                 cmake -H. -Bdbuild -DCMAKE_BUILD_TYPE=Release -DCMAKE_INSTALL_PREFIX=/usr -DBUILD_WSI_MIR_SUPPORT=OFF -DGLSLANG_SPIRV_INCLUDE_DIR=/usr/include/spirv-tools -DBUILD_LAYERS=ON
                but to no avail.

                Code:
                 
                 [ 30%] Building CXX object layers/CMakeFiles/VkLayer_core_validation.dir/shader_validation.cpp.o /home/desktop/git-projects/Vulkan-LoaderAndValidationLayers/layers/shader_validation.cpp: In function ‘bool validate_shader_capabilities(core_validation::layer_data*, const shader_module*)’: /home/desktop/git-projects/Vulkan-LoaderAndValidationLayers/layers/shader_validation.cpp:1205:10: error: CapabilityDrawParameters’ is not a member of ‘spv’          {spv::CapabilityDrawParameters, {VK_KHR_SHADER_DRAW_PARAMETERS_EXTENSION_NAME, nullptr, &E::vk_khr_shader_draw_parameters}},           ^~~ /home/desktop/git-projects/Vulkan-LoaderAndValidationLayers/layers/shader_validation.cpp:1206:10: error: CapabilityGeometryShaderPassthroughNV’ is not a member of ‘spv’          {spv::CapabilityGeometryShaderPassthroughNV, {VK_NV_GEOMETRY_SHADER_PASSTHROUGH_EXTENSION_NAME, nullptr, &E::vk_nv_geometry_shader_passthrough}},           ^~~ /home/desktop/git-projects/Vulkan-LoaderAndValidationLayers/layers/shader_validation.cpp:1207:10: error: CapabilitySampleMaskOverrideCoverageNV’ is not a member of ‘spv’          {spv::CapabilitySampleMaskOverrideCoverageNV, {VK_NV_SAMPLE_MASK_OVERRIDE_COVERAGE_EXTENSION_NAME, nullptr, &E::vk_nv_sample_mask_override_coverage}},           ^~~ /home/desktop/git-projects/Vulkan-LoaderAndValidationLayers/layers/shader_validation.cpp:1208:10: error: CapabilityShaderViewportIndexLayerNV’ is not a member of ‘spv’          {spv::CapabilityShaderViewportIndexLayerNV, {VK_NV_VIEWPORT_ARRAY2_EXTENSION_NAME, nullptr, &E::vk_nv_viewport_array2}},           ^~~ /home/desktop/git-projects/Vulkan-LoaderAndValidationLayers/layers/shader_validation.cpp:1209:10: error: CapabilityShaderViewportMaskNV’ is not a member of ‘spv’          {spv::CapabilityShaderViewportMaskNV, {VK_NV_VIEWPORT_ARRAY2_EXTENSION_NAME, nullptr, &E::vk_nv_viewport_array2}},           ^~~ /home/desktop/git-projects/Vulkan-LoaderAndValidationLayers/layers/shader_validation.cpp:1211:10: error: CapabilitySubgroupVoteKHR’ is not a member of ‘spv’          {spv::CapabilitySubgroupVoteKHR, {VK_EXT_SHADER_SUBGROUP_VOTE_EXTENSION_NAME, nullptr, &E::vk_ext_shader_subgroup_vote }},           ^~~ /home/desktop/git-projects/Vulkan-LoaderAndValidationLayers/layers/shader_validation.cpp:1212:5: error: could not convert ‘{{CapabilityMatrix, {nullptr}}, {CapabilityShader, {nullptr}}, {CapabilityInputAttachment, {nullptr}}, {CapabilitySampled1D, {nullptr}}, {CapabilityImage1D, {nullptr}}, {CapabilitySampledBuffer, {nullptr}}, {CapabilityImageQuery, {nullptr}}, {CapabilityDerivativeControl, {nullptr}}, {CapabilityGeometry, {"geometryShader", &VkPhysicalDeviceFeatures::geometryShader}}, {CapabilityTessellation, {"tessellationShader", &VkPhysicalDeviceFeatures::tessellationShader}}, {CapabilityFloat64, {"shaderFloat64", &VkPhysicalDeviceFeatures::shaderFloat64}}, {CapabilityInt64, {"shaderInt64", &VkPhysicalDeviceFeatures::shaderInt64}}, {CapabilityTessellationPointSize, {"shaderTessellationAndGeometryPointSize", &VkPhysicalDeviceFeatures::shaderTessellationAndGeometryPointSize}}, {CapabilityGeometryPointSize, {"shaderTessellationAndGeometryPointSize", &VkPhysicalDeviceFeatures::shaderTessellationAndGeometryPointSize}}, {CapabilityImageGatherExtended, {"shaderImageGatherExtended", &VkPhysicalDeviceFeatures::shaderImageGatherExtended}}, {CapabilityStorageImageMultisample, {"shaderStorageImageMultisample", &VkPhysicalDeviceFeatures::shaderStorageImageMultisample}}, {CapabilityUniformBufferArrayDynamicIndexing, {"shaderUniformBufferArrayDynamicIndexing", &VkPhysicalDeviceFeatures::shaderUniformBufferArrayDynamicIndexing}}, {CapabilitySampledImageArrayDynamicIndexing, {"shaderSampledImageArrayDynamicIndexing", &VkPhysicalDeviceFeatures::shaderSampledImageArrayDynamicIndexing}}, {CapabilityStorageBufferArrayDynamicIndexing, {"shaderStorageBufferArrayDynamicIndexing", &VkPhysicalDeviceFeatures::shaderStorageBufferArrayDynamicIndexing}}, {CapabilityStorageImageArrayDynamicIndexing, {"shaderStorageImageArrayDynamicIndexing", &VkPhysicalDeviceFeatures::shaderStorageBufferArrayDynamicIndexing}}, {CapabilityClipDistance, {"shaderClipDistance", &VkPhysicalDeviceFeatures::shaderClipDistance}}, {CapabilityCullDistance, {"shaderCullDistance", &VkPhysicalDeviceFeatures::shaderCullDistance}}, {CapabilityImageCubeArray, {"imageCubeArray", &VkPhysicalDeviceFeatures::imageCubeArray}}, {CapabilitySampleRateShading, {"sampleRateShading", &VkPhysicalDeviceFeatures::sampleRateShading}}, {CapabilitySparseResidency, {"shaderResourceResidency", &VkPhysicalDeviceFeatures::shaderResourceResidency}}, {CapabilityMinLod, {"shaderResourceMinLod", &VkPhysicalDeviceFeatures::shaderResourceMinLod}}, {CapabilitySampledCubeArray, {"imageCubeArray", &VkPhysicalDeviceFeatures::imageCubeArray}}, {CapabilityImageMSArray, {"shaderStorageImageMultisample", &VkPhysicalDeviceFeatures::shaderStorageImageMultisample}}, {CapabilityStorageImageExtendedFormats, {"shaderStorageImageExtendedFormats", &VkPhysicalDeviceFeatures::shaderStorageImageExtendedFormats}}, {CapabilityInterpolationFunction, {"sampleRateShading", &VkPhysicalDeviceFeatures::sampleRateShading}}, {CapabilityStorageImageReadWithoutFormat, {"shaderStorageImageReadWithoutFormat", &VkPhysicalDeviceFeatures::shaderStorageImageReadWithoutFormat}}, {CapabilityStorageImageWriteWithoutFormat, {"shaderStorageImageWriteWithoutFormat", &VkPhysicalDeviceFeatures::shaderStorageImageWriteWithoutFormat}}, {CapabilityMultiViewport, {"multiViewport", &VkPhysicalDeviceFeatures::multiViewport}}, {<expression error>, {"VK_KHR_shader_draw_parameters", nullptr, &DeviceExtensions::vk_khr_shader_draw_parameters}}, {<expression error>, {"VK_NV_geometry_shader_passthrough", nullptr, &DeviceExtensions::vk_nv_geometry_shader_passthrough}}, {<expression error>, {"VK_NV_sample_mask_override_coverage", nullptr, &DeviceExtensions::vk_nv_sample_mask_override_coverage}}, {<expression error>, {"VK_NV_viewport_array2", nullptr, &DeviceExtensions::vk_nv_viewport_array2}}, {<expression error>, {"VK_NV_viewport_array2", nullptr, &DeviceExtensions::vk_nv_viewport_array2}}, {CapabilitySubgroupBallotKHR, {"VK_EXT_shader_subgroup_ballot", nullptr, &DeviceExtensions::vk_ext_shader_subgroup_ballot}}, {<expression error>, {"VK_EXT_shader_subgroup_vote", nullptr, &DeviceExtensions::vk_ext_shader_subgroup_vote}}}’ from ‘<brace-enclosed initializer list>’ to ‘const std::unordered_map<unsigned int, validate_shader_capabilities(core_validation::layer_data*, const shader_module*)::CapabilityInfo>};      ^ make[2]: *** [layers/CMakeFiles/VkLayer_core_validation.dir/build.make:159: layers/CMakeFiles/VkLayer_core_validation.dir/shader_validation.cpp.o] Error 1 make[1]: *** [CMakeFiles/Makefile2:1442: layers/CMakeFiles/VkLayer_core_validation.dir/all] Error 2 make: *** [Makefile:130: all] Error 2

                Comment

                Working...
                X